{"text_format":"1","workbook":"xlsx","n_sheets":9,"sheets":["Cultural Gap Assessment - WHOLE","SURVEYSTAT","STAT1","STAT2","RESULTS SCALE","INTERPRETATION","DIVISIONAL COMPARISON","SUMMARY STAT","QUESTIONS"],"not_rendered":{"charts":3,"images":0,"macros":1,"external_links":0,"defined_names":0,"comments":0,"pivot_tables":0},"unopened":[],"bounds":{"document_bytes":16777216,"sheet_cells":100000,"rows_first":2000,"rows_last":500,"rows_between":2000,"halvings":0,"cell_chars":16384,"cell_head_chars":4096},"cells_cut":0,"cells_raw":0,"read":"whole","date_system":"1900"}

{"sheet":"Cultural Gap Assessment - WHOLE","index":0,"n_rows":78,"n_cols":8,"rows_kept":78,"cut":false,"hidden":false,"merged":[]}
[]
[null,"Legacy Team Identification","Please select"]
[]
[null,"Cultural Dimension"]
[]
[null,"Strategic Orientation",1,2,3,4,5]
["S1","People/culture/organizational capability focused",null,null,null,null,null,"Market/profitability/shareholder value focused"]
["S2","People understand and are focused on the long-term mission & strategy ",null,null,null,null,null,"People are focused on doing business as usual or managing crises"]
["S3","Outcome-driven",null,null,null,null,null,"Process-driven"]
["S4","Growth stage of lifecycle",null,null,null,null,null,"Decline and disruption stage of lifecycle"]
{"$rows_left_out":69}
{"sheet":"SURVEYSTAT","index":1,"n_rows":71,"n_cols":7,"rows_kept":71,"cut":false,"hidden":false,"merged":[]}
[null,"Please select"]
[null,"Business1"]
[null,"Business2"]
[null,"Business3"]
[null,"Business4"]
[]
[null,"Resp",1]
[null,"Bus","Business1"]
[null,null,1,2,3,4,5]
[1,"S1"]
{"$rows_left_out":62}
{"sheet":"STAT1","index":2,"n_rows":71,"n_cols":7,"rows_kept":71,"cut":false,"hidden":false,"merged":[]}
[null,"Please select"]
[null,"Business1"]
[null,"Business2"]
[null,"Business3"]
[null,"Business4"]
[]
[null,"Resp",1]
[null,"Bus","Business1"]
[null,null,1,2,3,4,5]
[1,"S1",null,true]
{"$rows_left_out":62}
{"sheet":"STAT2","index":3,"n_rows":71,"n_cols":7,"rows_kept":71,"cut":false,"hidden":false,"merged":[]}
[null,"Please select"]
[null,"Business1"]
[null,"Business2"]
[null,"Business3"]
[null,"Business4"]
[]
[null,"Resp",2]
[null,"Bus","Business2"]
[null,null,1,2,3,4,5]
[1,"S1",null,null,null,true]
{"$rows_left_out":62}
{"sheet":"RESULTS SCALE","index":4,"n_rows":64,"n_cols":24,"rows_kept":64,"cut":false,"hidden":false,"merged":[[0,20,6,20],[8,20,13,20],[15,20,20,20],[1,23,2,23]]}
[null,null,null,null,null,null,null,null,null,null,null,null,null,null,null,null,null,null,null,null,"MIDDLE POINT (equal number of responses above and below)",null,"DO NOT MOVE"]
["Question","HIGH","LOW","MEDIAN","Question2","HIGH ","LOW ","AVERAGE","Question3","HIGH  ","LOW  ","MODE",null,null,null,null,null,null,null,null,null,null,"SELECT ENTITY","select and run filter every time"]
["S1",{"$f":"INDEX('SUMMARY STAT'!$A$11:$BL$34,MATCH('RESULTS SCALE'!$B$2,'SUMMARY STAT'!$A$11:$A$34,0),MATCH('RESULTS SCALE'!A3,'SUMMARY STAT'!$A$11:$BL$11,0))","v":2},{"$f":"INDEX('SUMMARY STAT'!$A$11:$BL$34,MATCH('RESULTS SCALE'!$C$2,'SUMMARY STAT'!$A$11:$A$34,0),MATCH('RESULTS SCALE'!A3,'SUMMARY STAT'!$A$11:$BL$11,0))","v":2},{"$f":"INDEX('SUMMARY STAT'!$A$11:$BL$34,MATCH('RESULTS SCALE'!$D$2,'SUMMARY STAT'!$A$11:$A$34,0),MATCH('RESULTS SCALE'!A3,'SUMMARY STAT'!$A$11:$BL$11,0))","v":2},"S1",{"$f":"Table3[[#This Row],[HIGH]]","v":2},{"$f":"Table3[[#This Row],[LOW]]","v":2},{"$f":"INDEX('SUMMARY STAT'!$A$11:$BL$34,MATCH('RESULTS SCALE'!$H$2,'SUMMARY STAT'!$A$11:$A$34,0),MATCH('RESULTS SCALE'!A3,'SUMMARY STAT'!$A$11:$BL$11,0))","v":2},"S1",{"$f":"Table3[[#This Row],[HIGH]]","v":2},{"$f":"Table3[[#This Row],[LOW]]","v":2},{"$f":"INDEX('SUMMARY STAT'!$A$11:$BL$34,MATCH('RESULTS SCALE'!$L$2,'SUMMARY STAT'!$A$11:$A$34,0),MATCH('RESULTS SCALE'!A3,'SUMMARY STAT'!$A$11:$BL$11,0))","v":0},null,null,null,null,null,null,null,null,null,null,"Business1"]
["S2",{"$f":"INDEX('SUMMARY STAT'!$A$11:$BL$34,MATCH('RESULTS SCALE'!$B$2,'SUMMARY STAT'!$A$11:$A$34,0),MATCH('RESULTS SCALE'!A4,'SUMMARY STAT'!$A$11:$BL$11,0))","v":4},{"$f":"INDEX('SUMMARY STAT'!$A$11:$BL$34,MATCH('RESULTS SCALE'!$C$2,'SUMMARY STAT'!$A$11:$A$34,0),MATCH('RESULTS SCALE'!A4,'SUMMARY STAT'!$A$11:$BL$11,0))","v":4},{"$f":"INDEX('SUMMARY STAT'!$A$11:$BL$34,MATCH('RESULTS SCALE'!$D$2,'SUMMARY STAT'!$A$11:$A$34,0),MATCH('RESULTS SCALE'!A4,'SUMMARY STAT'!$A$11:$BL$11,0))","v":4},"S2",{"$f":"Table3[[#This Row],[HIGH]]","v":4},{"$f":"Table3[[#This Row],[LOW]]","v":4},{"$f":"INDEX('SUMMARY STAT'!$A$11:$BL$34,MATCH('RESULTS SCALE'!$H$2,'SUMMARY STAT'!$A$11:$A$34,0),MATCH('RESULTS SCALE'!A4,'SUMMARY STAT'!$A$11:$BL$11,0))","v":4},"S2",{"$f":"Table3[[#This Row],[HIGH]]","v":4},{"$f":"Table3[[#This Row],[LOW]]","v":4},{"$f":"INDEX('SUMMARY STAT'!$A$11:$BL$34,MATCH('RESULTS SCALE'!$L$2,'SUMMARY STAT'!$A$11:$A$34,0),MATCH('RESULTS SCALE'!A4,'SUMMARY STAT'!$A$11:$BL$11,0))","v":0}]
["S3",{"$f":"INDEX('SUMMARY STAT'!$A$11:$BL$34,MATCH('RESULTS SCALE'!$B$2,'SUMMARY STAT'!$A$11:$A$34,0),MATCH('RESULTS SCALE'!A5,'SUMMARY STAT'!$A$11:$BL$11,0))","v":2},{"$f":"INDEX('SUMMARY STAT'!$A$11:$BL$34,MATCH('RESULTS SCALE'!$C$2,'SUMMARY STAT'!$A$11:$A$34,0),MATCH('RESULTS SCALE'!A5,'SUMMARY STAT'!$A$11:$BL$11,0))","v":2},{"$f":"INDEX('SUMMARY STAT'!$A$11:$BL$34,MATCH('RESULTS SCALE'!$D$2,'SUMMARY STAT'!$A$11:$A$34,0),MATCH('RESULTS SCALE'!A5,'SUMMARY STAT'!$A$11:$BL$11,0))","v":2},"S3",{"$f":"Table3[[#This Row],[HIGH]]","v":2},{"$f":"Table3[[#This Row],[LOW]]","v":2},{"$f":"INDEX('SUMMARY STAT'!$A$11:$BL$34,MATCH('RESULTS SCALE'!$H$2,'SUMMARY STAT'!$A$11:$A$34,0),MATCH('RESULTS SCALE'!A5,'SUMMARY STAT'!$A$11:$BL$11,0))","v":2},"S3",{"$f":"Table3[[#This Row],[HIGH]]","v":2},{"$f":"Table3[[#This Row],[LOW]]","v":2},{"$f":"INDEX('SUMMARY STAT'!$A$11:$BL$34,MATCH('RESULTS SCALE'!$L$2,'SUMMARY STAT'!$A$11:$A$34,0),MATCH('RESULTS SCALE'!A5,'SUMMARY STAT'!$A$11:$BL$11,0))","v":2}]
["S4",{"$f":"INDEX('SUMMARY STAT'!$A$11:$BL$34,MATCH('RESULTS SCALE'!$B$2,'SUMMARY STAT'!$A$11:$A$34,0),MATCH('RESULTS SCALE'!A6,'SUMMARY STAT'!$A$11:$BL$11,0))","v":3},{"$f":"INDEX('SUMMARY STAT'!$A$11:$BL$34,MATCH('RESULTS SCALE'!$C$2,'SUMMARY STAT'!$A$11:$A$34,0),MATCH('RESULTS SCALE'!A6,'SUMMARY STAT'!$A$11:$BL$11,0))","v":3},{"$f":"INDEX('SUMMARY STAT'!$A$11:$BL$34,MATCH('RESULTS SCALE'!$D$2,'SUMMARY STAT'!$A$11:$A$34,0),MATCH('RESULTS SCALE'!A6,'SUMMARY STAT'!$A$11:$BL$11,0))","v":3},"S4",{"$f":"Table3[[#This Row],[HIGH]]","v":3},{"$f":"Table3[[#This Row],[LOW]]","v":3},{"$f":"INDEX('SUMMARY STAT'!$A$11:$BL$34,MATCH('RESULTS SCALE'!$H$2,'SUMMARY STAT'!$A$11:$A$34,0),MATCH('RESULTS SCALE'!A6,'SUMMARY STAT'!$A$11:$BL$11,0))","v":3},"S4",{"$f":"Table3[[#This Row],[HIGH]]","v":3},{"$f":"Table3[[#This Row],[LOW]]","v":3},{"$f":"INDEX('SUMMARY STAT'!$A$11:$BL$34,MATCH('RESULTS SCALE'!$L$2,'SUMMARY STAT'!$A$11:$A$34,0),MATCH('RESULTS SCALE'!A6,'SUMMARY STAT'!$A$11:$BL$11,0))","v":0}]
["S5",{"$f":"INDEX('SUMMARY STAT'!$A$11:$BL$34,MATCH('RESULTS SCALE'!$B$2,'SUMMARY STAT'!$A$11:$A$34,0),MATCH('RESULTS SCALE'!A7,'SUMMARY STAT'!$A$11:$BL$11,0))","v":4},{"$f":"INDEX('SUMMARY STAT'!$A$11:$BL$34,MATCH('RESULTS SCALE'!$C$2,'SUMMARY STAT'!$A$11:$A$34,0),MATCH('RESULTS SCALE'!A7,'SUMMARY STAT'!$A$11:$BL$11,0))","v":4},{"$f":"INDEX('SUMMARY STAT'!$A$11:$BL$34,MATCH('RESULTS SCALE'!$D$2,'SUMMARY STAT'!$A$11:$A$34,0),MATCH('RESULTS SCALE'!A7,'SUMMARY STAT'!$A$11:$BL$11,0))","v":4},"S5",{"$f":"Table3[[#This Row],[HIGH]]","v":4},{"$f":"Table3[[#This Row],[LOW]]","v":4},{"$f":"INDEX('SUMMARY STAT'!$A$11:$BL$34,MATCH('RESULTS SCALE'!$H$2,'SUMMARY STAT'!$A$11:$A$34,0),MATCH('RESULTS SCALE'!A7,'SUMMARY STAT'!$A$11:$BL$11,0))","v":4},"S5",{"$f":"Table3[[#This Row],[HIGH]]","v":4},{"$f":"Table3[[#This Row],[LOW]]","v":4},{"$f":"INDEX('SUMMARY STAT'!$A$11:$BL$34,MATCH('RESULTS SCALE'!$L$2,'SUMMARY STAT'!$A$11:$A$34,0),MATCH('RESULTS SCALE'!A7,'SUMMARY STAT'!$A$11:$BL$11,0))","v":0}]
["S6",{"$f":"INDEX('SUMMARY STAT'!$A$11:$BL$34,MATCH('RESULTS SCALE'!$B$2,'SUMMARY STAT'!$A$11:$A$34,0),MATCH('RESULTS SCALE'!A8,'SUMMARY STAT'!$A$11:$BL$11,0))","v":2},{"$f":"INDEX('SUMMARY STAT'!$A$11:$BL$34,MATCH('RESULTS SCALE'!$C$2,'SUMMARY STAT'!$A$11:$A$34,0),MATCH('RESULTS SCALE'!A8,'SUMMARY STAT'!$A$11:$BL$11,0))","v":2},{"$f":"INDEX('SUMMARY STAT'!$A$11:$BL$34,MATCH('RESULTS SCALE'!$D$2,'SUMMARY STAT'!$A$11:$A$34,0),MATCH('RESULTS SCALE'!A8,'SUMMARY STAT'!$A$11:$BL$11,0))","v":2},"S6",{"$f":"Table3[[#This Row],[HIGH]]","v":2},{"$f":"Table3[[#This Row],[LOW]]","v":2},{"$f":"INDEX('SUMMARY STAT'!$A$11:$BL$34,MATCH('RESULTS SCALE'!$H$2,'SUMMARY STAT'!$A$11:$A$34,0),MATCH('RESULTS SCALE'!A8,'SUMMARY STAT'!$A$11:$BL$11,0))","v":2},"S6",{"$f":"Table3[[#This Row],[HIGH]]","v":2},{"$f":"Table3[[#This Row],[LOW]]","v":2},{"$f":"INDEX('SUMMARY STAT'!$A$11:$BL$34,MATCH('RESULTS SCALE'!$L$2,'SUMMARY STAT'!$A$11:$A$34,0),MATCH('RESULTS SCALE'!A8,'SUMMARY STAT'!$A$11:$BL$11,0))","v":0}]
["S7",{"$f":"INDEX('SUMMARY STAT'!$A$11:$BL$34,MATCH('RESULTS SCALE'!$B$2,'SUMMARY STAT'!$A$11:$A$34,0),MATCH('RESULTS SCALE'!A9,'SUMMARY STAT'!$A$11:$BL$11,0))","v":2},{"$f":"INDEX('SUMMARY STAT'!$A$11:$BL$34,MATCH('RESULTS SCALE'!$C$2,'SUMMARY STAT'!$A$11:$A$34,0),MATCH('RESULTS SCALE'!A9,'SUMMARY STAT'!$A$11:$BL$11,0))","v":2},{"$f":"INDEX('SUMMARY STAT'!$A$11:$BL$34,MATCH('RESULTS SCALE'!$D$2,'SUMMARY STAT'!$A$11:$A$34,0),MATCH('RESULTS SCALE'!A9,'SUMMARY STAT'!$A$11:$BL$11,0))","v":2},"S7",{"$f":"Table3[[#This Row],[HIGH]]","v":2},{"$f":"Table3[[#This Row],[LOW]]","v":2},{"$f":"INDEX('SUMMARY STAT'!$A$11:$BL$34,MATCH('RESULTS SCALE'!$H$2,'SUMMARY STAT'!$A$11:$A$34,0),MATCH('RESULTS SCALE'!A9,'SUMMARY STAT'!$A$11:$BL$11,0))","v":2},"S7",{"$f":"Table3[[#This Row],[HIGH]]","v":2},{"$f":"Table3[[#This Row],[LOW]]","v":2},{"$f":"INDEX('SUMMARY STAT'!$A$11:$BL$34,MATCH('RESULTS SCALE'!$L$2,'SUMMARY STAT'!$A$11:$A$34,0),MATCH('RESULTS SCALE'!A9,'SUMMARY STAT'!$A$11:$BL$11,0))","v":0},null,null,null,null,null,null,null,null,"AVERAGE VALUE"]
["I1",{"$f":"INDEX('SUMMARY STAT'!$A$11:$BL$34,MATCH('RESULTS SCALE'!$B$2,'SUMMARY STAT'!$A$11:$A$34,0),MATCH('RESULTS SCALE'!A10,'SUMMARY STAT'!$A$11:$BL$11,0))","v":3},{"$f":"INDEX('SUMMARY STAT'!$A$11:$BL$34,MATCH('RESULTS SCALE'!$C$2,'SUMMARY STAT'!$A$11:$A$34,0),MATCH('RESULTS SCALE'!A10,'SUMMARY STAT'!$A$11:$BL$11,0))","v":3},{"$f":"INDEX('SUMMARY STAT'!$A$11:$BL$34,MATCH('RESULTS SCALE'!$D$2,'SUMMARY STAT'!$A$11:$A$34,0),MATCH('RESULTS SCALE'!A10,'SUMMARY STAT'!$A$11:$BL$11,0))","v":3},"I1",{"$f":"Table3[[#This Row],[HIGH]]","v":3},{"$f":"Table3[[#This Row],[LOW]]","v":3},{"$f":"INDEX('SUMMARY STAT'!$A$11:$BL$34,MATCH('RESULTS SCALE'!$H$2,'SUMMARY STAT'!$A$11:$A$34,0),MATCH('RESULTS SCALE'!A10,'SUMMARY STAT'!$A$11:$BL$11,0))","v":3},"I1",{"$f":"Table3[[#This Row],[HIGH]]","v":3},{"$f":"Table3[[#This Row],[LOW]]","v":3},{"$f":"INDEX('SUMMARY STAT'!$A$11:$BL$34,MATCH('RESULTS SCALE'!$L$2,'SUMMARY STAT'!$A$11:$A$34,0),MATCH('RESULTS SCALE'!A10,'SUMMARY STAT'!$A$11:$BL$11,0))","v":3}]
{"$rows_left_out":55}
{"sheet":"INTERPRETATION","index":5,"n_rows":241,"n_cols":8,"rows_kept":241,"cut":false,"hidden":false,"merged":[[1,7,2,7],[4,7,5,7]]}
["INTERPRETATION:",null,null,null,null,null,"DO NOT MOVE"]
[null,null,null,null,null,null,"Single Division","ALWAYS RESELECT on the Results Scale tab"]
["SECTION 1","Low/high average (average value is 2- or 4+): single division (or entire company if selected)",null,null,null,null,{"$f":"'RESULTS SCALE'!W3","v":"Business1"}]
[]
["These are areas of strong cultural identity for the division (or entire company if selected).  It is more significant if the standard ",null,null,null,null,null,"Multiple Divisions","ALWAYS RESELECT 2 divisions to compare"]
["deviation is small, meaning that responses are similar/tightly distributed around the average. (Standard deviation of nil",null,null,null,null,null,"B1-B2"]
["means that all responses included in the count were the same.)"]
[]
["They represent either strengths or threats, depending on whether they are aligned with strategy and project objectives."]
[]
{"$rows_left_out":232}
{"sheet":"DIVISIONAL COMPARISON","index":6,"n_rows":6,"n_cols":2,"rows_kept":6,"cut":false,"hidden":false,"merged":[]}
[]
[]
["COMPARE CODES:"]
["BIAS","Divisions are not significantly different but one division is more biased towards one end of the scale"]
["SAME","The divisions are aligned"]
["CONFLICT","The difference in average scores for the two divisions is statistically significant"]

{"sheet":"SUMMARY STAT","index":7,"n_rows":34,"n_cols":64,"rows_kept":34,"cut":false,"hidden":false,"merged":[]}
["Business","Business1"]
["Business","Business2"]
["Business","Business3"]
["Business","Business4"]
["Business","CompanyTotal"]
["Respondent / Question","Business","S1","S2","S3","S4","S5","S6","S7","I1","I2","I3","D1","D2","D3","C1","C2","C3","C4","C5","C6","C7","C8","C9","C10","C11","C12","C13","C14","C15","L1","L2","L3","R1","R2","R3","R4","R5","R6","R7","RT1","RT2","RT3","P1","P2","P3","P4","MP1","MP2","MP3","MP4","MP5","MP6","MP7","MP8","MP9","MP10","MP11","MP12","T1","T2","T3","T4","TECH1"]
[1,"Business1",2,4,2,3,4,2,2,3,2,3,2,3,2,2,3,4,2,2,2,2,1,2,2,3,2,3,1,1,2,2,3,2,4,4,2,5,4,3,4,2,2,4,3,2,1,3,4,3,1,2,3,2,3,3,1,2,5,2,2,2,1,3]
[2,"Business2",4,3,2,2,3,4,3,3,4,2,4,2,3,4,2,3,4,3,3,2,2,3,4,4,3,2,3,3,4,4,1,3,2,4,2,4,3,2,3,2,4,4,3,3,2,2,2,5,5,3,2,4,4,4,3,4,2,2,4,3,4,3]
[]
[]
{"$rows_left_out":25}
{"sheet":"QUESTIONS","index":8,"n_rows":74,"n_cols":3,"rows_kept":74,"cut":false,"hidden":false,"merged":[]}
["QUESTION","1","5"]
[null,"Strategic Orientation"]
["S1","People/culture/organizational capability focused","Market/profitability/shareholder value focused"]
["S2","People understand and are focused on the long-term mission & strategy ","People are focused on doing business as usual or managing crises"]
["S3","Outcome-driven","Process-driven"]
["S4","Growth stage of lifecycle","Decline and disruption stage of lifecycle"]
["S5","Short-term profit orientation","Long-term value orientation"]
["S6","Customer and market driven","Technology driven"]
["S7","Fast and flexible response / MVP approach","Quality, rigid process, and proven approaches paramount"]
[null,"Communication and Information Flow"]
{"$rows_left_out":64}